{"text_format":"1","workbook":"xlsx","n_sheets":12,"sheets":["Introduction","CP & Installation Detail","Pricing & Billing Detail","Single Order Summary","Multi CP & Installation Detail ","Multi Pricing & Billing Detail","Multi Order Summary","Ethernet Direct Access Costs","Ethernet Connect Access Costs","OWAS","Data Connect Access Costs","Data Direct Access Costs"],"not_rendered":{"charts":0,"images":2,"macros":0,"external_links":0,"defined_names":15,"comments":0,"pivot_tables":0},"unopened":[],"bounds":{"document_bytes":16777216,"sheet_cells":100000,"rows_first":2000,"rows_last":500,"rows_between":2000,"halvings":0,"cell_chars":16384,"cell_head_chars":4096},"cells_cut":0,"cells_raw":0,"read":"whole","date_system":"1900"}

{"sheet":"Introduction","index":0,"n_rows":22,"n_cols":4,"rows_kept":22,"cut":false,"hidden":false,"merged":[[15,2,15,3]]}
[]
[]
[null,null,null,"Order Form for the provision of \nLeased Lines and Ethernet Services"]
[]
[]
[]
[null,null,"This is the application form for the provision of new circuits for the below products:"]
[]
{"$rows_left_out":15}
{"sheet":"CP & Installation Detail","index":1,"n_rows":43,"n_cols":32,"rows_kept":43,"cut":false,"hidden":false,"merged":[[17,2,17,3],[22,2,22,3],[23,2,23,3],[24,2,24,3],[37,2,37,4],[31,2,31,3],[32,2,32,3],[34,2,34,3],[35,2,35,3],[25,2,25,3],[26,2,26,3],[27,2,27,3],[28,2,28,3],[29,2,29,3],[15,6,16,8],[6,2,6,3],[7,2,7,3],[8,2,8,3],[9,2,9,3],[13,2,13,3],[14,2,14,3],[15,2,15,3]]}
[null,null,null,null,null,null,null,null,null,null,null,null,null,null,null,null,null,null,null,"No Product Selected",null,{"$f":"NOW()","v":"2023-08-08T09:42:24.760"}]
[null,null,null,null,"Single Orders",null,null,null,null,null,null,null,null,null,null,null,null,null,null,"Data Direct Access Service"]
[null,null,null,null,null,null,null,null,null,null,null,null,null,null,null,null,null,null,null,"Data Connect Access Service"]
[null,null,null,null,null,null,null,null,null,null,null,null,null,null,null,null,null,null,null,"Ethernet Direct Access Service"]
[null,null,null,null,null,null,null,null,null,null,null,null,null,null,null,null,null,null,null,"Ethernet Connect Access Service"]
[null,null,"Section 1: CP Details",null,null,null,null,null,null,null,null,null,null,null,null,null,null,null,null,"Optical Wave Access Service"]
[null,null,"Company Name"]
[null,null,"Contact Name"]
{"$rows_left_out":36}
{"sheet":"Pricing & Billing Detail","index":2,"n_rows":31,"n_cols":14,"rows_kept":31,"cut":false,"hidden":false,"merged":[[25,2,29,5],[9,5,11,5]]}
[]
[null,null,null,null,null,null,null,null,null,null,null,"Order 1","Connection ","Rental"]
[]
[]
[]
[]
[null,null,"Section 4: Pricing",null,null,null,null,null,null,null,null,"Data Direct Access Service",{"$f":"'Data Direct Access Costs'!C29","v":{"$error":"#N/A"}},{"$f":"'Data Direct Access Costs'!B31","v":{"$error":"#N/A"}}]
[null,null,"Product","Service","Connection Charge Exc. VAT","Annual Rental\nExc. VAT",null,null,null,null,null,"Data Connect Access Service",{"$f":"'Data Connect Access Costs'!C29","v":{"$error":"#N/A"}},{"$f":"'Data Connect Access Costs'!B31","v":{"$error":"#N/A"}}]
{"$rows_left_out":24}
{"sheet":"Single Order Summary","index":3,"n_rows":35,"n_cols":4,"rows_kept":35,"cut":false,"hidden":false,"merged":[[10,2,11,5],[5,3,5,4],[6,3,6,4],[7,3,7,4],[8,3,8,4],[9,3,9,4],[15,3,15,4],[13,3,13,4],[14,3,14,4],[17,2,21,5],[34,2,35,5],[31,4,31,5],[32,4,32,5],[28,2,29,5]]}
[]
[]
[null,null,null,"Wholesale"]
[]
[null,null,"Single Order Summary"]
[null,null,"Product",{"$f":"IF('CP & Installation Detail'!E14=\"\",\"No Bandwidth Specified\",'CP & Installation Detail'!E14)","v":"No Product Selected"}]
[null,null,"Bandwidth",{"$f":"IF('CP & Installation Detail'!E15=\"\",\"No Bandwidth Specified\",'CP & Installation Detail'!E15)","v":"No Bandwidth Specified"}]
[null,null,"Connection Charge ExVAT",{"$f":"'Pricing & Billing Detail'!E9","v":"-"}]
{"$rows_left_out":28}
{"sheet":"Multi CP & Installation Detail ","index":4,"n_rows":50,"n_cols":21,"rows_kept":50,"cut":false,"hidden":true,"merged":[[8,10,9,10],[8,15,9,15],[2,6,2,7],[2,8,2,9],[2,10,2,11],[3,6,3,7],[3,8,3,9],[3,10,3,11],[5,6,5,7],[3,12,3,15],[2,4,2,5],[5,4,5,5],[7,4,7,5],[5,8,5,9],[2,12,2,15]]}
[]
[]
[null,null,null,null,"Section 1 CP Details:-",null,"Company Name",null,"Contact Name",null,"Contact Telephone Number",null,"Email Address",null,null,null,null,null,null,{"$f":"IF(OR($I$6=$T$17),$T$25:$T$27,IF(OR($I$6=$S$17),$S$25:$S$27,IF(OR($I$6=$U$17),$U$24:$U$25)))","v":{"$error":"#VALUE!"}}]
[null,null,null,null,null,null,"BT Business",null,"Jordan Miller",null,null,null,"jordan.miller@bt.com",null,null,null,null,null,null,{"$f":"IF(OR($I$6=$S$17),$S$18:$S$23,IF(OR($I$6=$T$17),$T$18:$T$23,IF(OR($I$6=$U$17),$U$18:$U$22)))","v":{"$error":"#VALUE!"}}]
[]
[null,null,null,null,"Section 2 New Product Requirements:-",null,"Multiple Circuit Requirements :",null,"Optical Wave Access Service",null,"5 Years"]
[]
[null,null,null,null,"Section 3: Installation Details:",null,null,null,null,null,null,null,null,null,null,null,null,null,null,"No Product Selected"]
{"$rows_left_out":43}
{"sheet":"Multi Pricing & Billing Detail","index":5,"n_rows":47,"n_cols":51,"rows_kept":47,"cut":false,"hidden":true,"merged":[[41,2,45,5]]}
[null,null,null,null,null,null,null,null,null,null,null,null,"edas","edas","ecas","ecas","owas","owas"]
[null,null,null,null,null,null,null,null,null,null,null,"SINGLE Order ","Connection ","Rental","Connection ","Rental","Connection ","Rental"]
[null,null,null,null,null,null,null,null,null,null,null,1,{"$f":"'Ethernet Direct Access Costs'!E18+'Ethernet Direct Access Costs'!I18","v":{"$error":"#N/A"}},{"$f":"'Ethernet Direct Access Costs'!K18","v":{"$error":"#N/A"}},{"$f":"'Ethernet Connect Access Costs'!D16","v":"3 Year Term Not Available"},{"$f":"'Ethernet Connect Access Costs'!G16","v":0},{"$f":"OWAS!H8","v":{"$error":"#N/A"}},{"$f":"OWAS!I8","v":"£"}]
[null,null,null,null,null,null,null,null,null,null,null,"Connection",null,null,null,null,null,null,null,null,null,null,null,null,null,null,null,null,null,null,null,"Rental"]
[null,null,"Section 4: Pricing",null,null,null,null,null,null,null,"Multi-Order",1,2,3,4,5,6,7,8,9,10,11,12,13,14,15,16,17,18,19,20,1,2,3,4,5,6,7,8,9,10,11,12,13,14,15,16,17,18,19,20]
[null,null,"Product","Service","Connection Charge Exc. VAT","Annual Rental\nExc. VAT"]
[null,{"$f":"'Multi CP & Installation Detail '!E11","v":1},{"$f":"IF(OR('Multi CP & Installation Detail '!$I$6=\"No Product Selected\",ISBLANK('Multi CP & Installation Detail '!F11)),\"\",'Multi CP & Installation Detail '!$I$6)","v":""},{"$f":"IF(OR('Multi CP & Installation Detail '!F11=\"No Service Selected\",ISBLANK('Multi CP & Installation Detail '!F11)),\"\",'Multi CP & Installation Detail '!F11)","v":""},{"$f":"IFERROR(IF(OR(D7=\"\",D7=\"-\"),\"£\",VLOOKUP(C7,$K$5:$AE$9,2,FALSE)),\"-\")","v":"£"},{"$f":"IFERROR(IF(OR(D7=\"\",D7=\"-\"),\"-\",IF('Multi CP & Installation Detail '!K6=\"Term\",\"Confirm Initial Term\",VLOOKUP(C7,$K$7:$AY$9,22,FALSE))),\"-\")","v":"-"},null,null,null,null,"Ethernet Direct Access Service",{"$f":"'Ethernet Direct Access Costs'!E20","v":""},{"$f":"'Ethernet Direct Access Costs'!E21+'Ethernet Direct Access Costs'!I21","v":{"$error":"#VALUE!"}},{"$f":"'Ethernet Direct Access Costs'!E22+'Ethernet Direct Access Costs'!I22","v":{"$error":"#VALUE!"}},{"$f":"'Ethernet Direct Access Costs'!E23+'Ethernet Direct Access Costs'!I23","v":{"$error":"#VALUE!"}},{"$f":"'Ethernet Direct Access Costs'!E24+'Ethernet Direct Access Costs'!I24","v":{"$error":"#VALUE!"}},{"$f":"'Ethernet Direct Access Costs'!E25+'Ethernet Direct Access Costs'!I25","v":{"$error":"#VALUE!"}},{"$f":"'Ethernet Direct Access Costs'!E26+'Ethernet Direct Access Costs'!I26","v":{"$error":"#VALUE!"}},{"$f":"'Ethernet Direct Access Costs'!E27+'Ethernet Direct Access Costs'!I27","v":{"$error":"#VALUE!"}},{"$f":"'Ethernet Direct Access Costs'!E28+'Ethernet Direct Access Costs'!I28","v":{"$error":"#VALUE!"}},{"$f":"'Ethernet Direct Access Costs'!E29+'Ethernet Direct Access Costs'!I29","v":{"$error":"#VALUE!"}},{"$f":"'Ethernet Direct Access Costs'!E30+'Ethernet Direct Access Costs'!I30","v":{"$error":"#VALUE!"}},{"$f":"'Ethernet Direct Access Costs'!E31+'Ethernet Direct Access Costs'!I31","v":{"$error":"#VALUE!"}},{"$f":"'Ethernet Direct Access Costs'!E32+'Ethernet Direct Access Costs'!I32","v":{"$error":"#VALUE!"}},{"$f":"'Ethernet Direct Access Costs'!E33+'Ethernet Direct Access Costs'!I33","v":{"$error":"#VALUE!"}},{"$f":"'Ethernet Direct Access Costs'!E34+'Ethernet Direct Access Costs'!I34","v":{"$error":"#VALUE!"}},{"$f":"'Ethernet Direct Access Costs'!E35+'Ethernet Direct Access Costs'!I35","v":{"$error":"#VALUE!"}},{"$f":"'Ethernet Direct Access Costs'!E36+'Ethernet Direct Access Costs'!I36","v":{"$error":"#VALUE!"}},{"$f":"'Ethernet Direct Access Costs'!E37+'Ethernet Direct Access Costs'!I37","v":{"$error":"#VALUE!"}},{"$f":"'Ethernet Direct Access Costs'!E38+'Ethernet Direct Access Costs'!I38","v":{"$error":"#VALUE!"}},{"$f":"'Ethernet Direct Access Costs'!E39+'Ethernet Direct Access Costs'!I39","v":{"$error":"#VALUE!"}},{"$f":"'Ethernet Direct Access Costs'!K20","v":{"$error":"#N/A"}},{"$f":"'Ethernet Direct Access Costs'!K21","v":{"$error":"#N/A"}},{"$f":"'Ethernet Direct Access Costs'!K22","v":{"$error":"#N/A"}},{"$f":"'Ethernet Direct Access Costs'!K23","v":{"$error":"#N/A"}},{"$f":"'Ethernet Direct Access Costs'!K24","v":{"$error":"#N/A"}},{"$f":"'Ethernet Direct Access Costs'!K25","v":{"$error":"#N/A"}},{"$f":"'Ethernet Direct Access Costs'!K26","v":{"$error":"#N/A"}},{"$f":"'Ethernet Direct Access Costs'!K27","v":{"$error":"#N/A"}},{"$f":"'Ethernet Direct Access Costs'!K28","v":{"$error":"#N/A"}},{"$f":"'Ethernet Direct Access Costs'!K29","v":{"$error":"#N/A"}},{"$f":"'Ethernet Direct Access Costs'!K30","v":{"$error":"#N/A"}},{"$f":"'Ethernet Direct Access Costs'!K31","v":{"$error":"#N/A"}},{"$f":"'Ethernet Direct Access Costs'!K32","v":{"$error":"#N/A"}},{"$f":"'Ethernet Direct Access Costs'!K33","v":{"$error":"#N/A"}},{"$f":"'Ethernet Direct Access Costs'!K34","v":{"$error":"#N/A"}},{"$f":"'Ethernet Direct Access Costs'!K35","v":{"$error":"#N/A"}},{"$f":"'Ethernet Direct Access Costs'!K36","v":{"$error":"#N/A"}},{"$f":"'Ethernet Direct Access Costs'!K37","v":{"$error":"#N/A"}},{"$f":"'Ethernet Direct Access Costs'!K38","v":{"$error":"#N/A"}},{"$f":"'Ethernet Direct Access Costs'!K39","v":{"$error":"#N/A"}}]
[null,{"$f":"'Multi CP & Installation Detail '!E12","v":2},{"$f":"IF(OR('Multi CP & Installation Detail '!$I$6=\"No Product Selected\",ISBLANK('Multi CP & Installation Detail '!F12)),\"\",'Multi CP & Installation Detail '!$I$6)","v":""},{"$f":"IF(OR('Multi CP & Installation Detail '!F12=\"No Service Selected\",ISBLANK('Multi CP & Installation Detail '!F12)),\"\",'Multi CP & Installation Detail '!F12)","v":""},{"$f":"IFERROR(IF(OR(D8=\"\",D8=\"-\"),\"£         -\",VLOOKUP(C8,$K$5:$AE$9,3,FALSE)),\"-\")","v":"£         -"},{"$f":"IFERROR(IF(OR(D8=\"\",D8=\"-\"),\"-\",IF('Multi CP & Installation Detail '!K7=\"Term\",\"Confirm Initial Term\",VLOOKUP(C8,$K$7:$AY$9,23,FALSE))),\"-\")","v":"-"},null,null,null,null,"Ethernet Connect Access Service",{"$f":"'Ethernet Connect Access Costs'!D18","v":""},{"$f":"'Ethernet Connect Access Costs'!D19","v":""},{"$f":"'Ethernet Connect Access Costs'!D20","v":""},{"$f":"'Ethernet Connect Access Costs'!D21","v":""},{"$f":"'Ethernet Connect Access Costs'!D22","v":""},{"$f":"'Ethernet Connect Access Costs'!D23","v":""},{"$f":"'Ethernet Connect Access Costs'!D24","v":""},{"$f":"'Ethernet Connect Access Costs'!D25","v":""},{"$f":"'Ethernet Connect Access Costs'!D26","v":""},{"$f":"'Ethernet Connect Access Costs'!D27","v":""},{"$f":"'Ethernet Connect Access Costs'!D28","v":""},{"$f":"'Ethernet Connect Access Costs'!D29","v":""},{"$f":"'Ethernet Connect Access Costs'!D30","v":""},{"$f":"'Ethernet Connect Access Costs'!D31","v":""},{"$f":"'Ethernet Connect Access Costs'!D32","v":""},{"$f":"'Ethernet Connect Access Costs'!D33","v":""},{"$f":"'Ethernet Connect Access Costs'!D34","v":""},{"$f":"'Ethernet Connect Access Costs'!D35","v":""},{"$f":"'Ethernet Connect Access Costs'!D36","v":""},{"$f":"'Ethernet Connect Access Costs'!D37","v":""},{"$f":"'Ethernet Connect Access Costs'!G18","v":false},{"$f":"'Ethernet Connect Access Costs'!G19","v":false},{"$f":"'Ethernet Connect Access Costs'!G20","v":false},{"$f":"'Ethernet Connect Access Costs'!G21","v":false},{"$f":"'Ethernet Connect Access Costs'!G22","v":false},{"$f":"'Ethernet Connect Access Costs'!G23","v":false},{"$f":"'Ethernet Connect Access Costs'!G24","v":false},{"$f":"'Ethernet Connect Access Costs'!G25","v":false},{"$f":"'Ethernet Connect Access Costs'!G26","v":false},{"$f":"'Ethernet Connect Access Costs'!G27","v":false},{"$f":"'Ethernet Connect Access Costs'!G28","v":false},{"$f":"'Ethernet Connect Access Costs'!G29","v":false},{"$f":"'Ethernet Connect Access Costs'!G30","v":false},{"$f":"'Ethernet Connect Access Costs'!G31","v":false},{"$f":"'Ethernet Connect Access Costs'!G32","v":false},{"$f":"'Ethernet Connect Access Costs'!G33","v":false},{"$f":"'Ethernet Connect Access Costs'!G34","v":false},{"$f":"'Ethernet Connect Access Costs'!G35","v":false},{"$f":"'Ethernet Connect Access Costs'!G36","v":false},{"$f":"'Ethernet Connect Access Costs'!G37","v":false}]
{"$rows_left_out":40}
{"sheet":"Multi Order Summary","index":6,"n_rows":29,"n_cols":11,"rows_kept":29,"cut":false,"hidden":true,"merged":[[9,17,22,20],[17,2,17,11],[13,2,16,11],[26,2,26,3],[26,4,26,6],[26,8,26,11],[28,2,28,11],[29,2,29,9],[5,8,5,9],[5,10,5,11],[25,2,25,3],[25,4,25,6],[25,8,25,11],[6,8,6,9],[6,10,6,11],[7,8,7,9],[7,10,7,11],[8,8,8,9],[8,10,8,11],[10,8,10,9],[10,10,10,11],[23,2,23,11]]}
[]
[null,null,null,null,"Wholesale"]
[]
[null,null,"Order Summary"]
[]
[null,null,"Order Type",null,null,null,null,"Quantity","Connection Charges",null,"Annual Charges"]
[null,null,"Ethernet Direct Access Service",null,null,null,null,{"$f":"IF('Multi Pricing & Billing Detail'!C7=\"Ethernet Direct Access Service\",COUNTIF('Multi Pricing & Billing Detail'!F7:F26,\">1\"),\"-\")","v":"-"},{"$f":"IF(H7=\"-\",\"-\",SUM('Multi Pricing & Billing Detail'!E7:E26))","v":"-"},null,{"$f":"IF(H7=\"-\",\"-\",SUM('Multi Pricing & Billing Detail'!F7:F26))","v":"-"}]
[null,null,"Ethernet Connect Access Service",null,null,null,null,{"$f":"IF('Multi Pricing & Billing Detail'!C7=\"Ethernet Connect Access Service\",COUNTIF('Multi Pricing & Billing Detail'!F7:F26,\">1\"),\"-\")","v":"-"},{"$f":"IF(H8=\"-\",\"-\",SUM('Multi Pricing & Billing Detail'!E7:E26))","v":"-"},null,{"$f":"IF(H8=\"-\",\"-\",SUM('Multi Pricing & Billing Detail'!F7:F26))","v":"-"}]
{"$rows_left_out":22}
{"sheet":"Ethernet Direct Access Costs","index":7,"n_rows":42,"n_cols":17,"rows_kept":42,"cut":false,"hidden":true,"merged":[[41,2,41,9]]}
[null,"Bandwidth","Connection Charge - New Fibre","Special Offer","Bandwidth","Connection Charge - Existing Fibre",null,"Bandwidth","Term","Rental Charge Per Annum ",null,null,"Bandwidth","Term","Rental Charge Per Annum ",null,"Rental Charge pre 1/4/23"]
[null,"10Mb",1700,"3 Year","10Mb",0,null,"10Mb","1 Year",3834,null,{"$f":"M2&N2","v":"10Mb1 Year"},"10Mb","1 Year",3834,null,3384]
[null,"100Mb",1700,"3 Year","100Mb",0,null,"100Mb","1 Year",3834,null,"10Mb3 Years","10Mb","3 Years","N/A Select 1 Year",null,"N/A Select 1 Year"]
[null,"1Gb",1700,"3 Year","1Gb",0,null,"1Gb","1 Year",3834,null,"100Mb1 Year","100Mb","1 Year",3834,null,3384]
[null,"10Gb",6000,"3 Year","10Gb",0,null,"10Gb","1 Year",6714,null,"100Mb3 Years","100Mb","3 Years","N/A Select 1 Year",null,"N/A Select 1 Year"]
[null,null,null,null,null,null,null,null,null,null,null,"1Gb1 Year","1Gb","1 Year",3834,null,3534]
[null,null,null,null,null,null,null,null,null,null,null,"1Gb3 Years","1Gb","3 Years","N/A Select 1 Year",null,"N/A Select 1 Year"]
[null,null,null,null,null,null,null,null,null,null,null,"1Gb5 Years","1Gb","5 Years","N/A Select 1 Year",null,"N/A Select 1 Year"]
{"$rows_left_out":35}
{"sheet":"Ethernet Connect Access Costs","index":8,"n_rows":37,"n_cols":21,"rows_kept":37,"cut":false,"hidden":true,"merged":[]}
["Bandwidth","Connection Charge - Standard","Special Offer","Bandwidth","Connection Charge - Special Offer",null,null,"Bandwidth","Term","Rental Charge Per Annum ",null,"Bandwidth","Term","Rental Charge Per Annum - any Exchange",null,null,null,"Prices amended 1/4/23",null,null,"Rental Charge Per Annum -pre 1/4/23"]
["10Mb",1700,"3 Year","10Mb",0,null,null,"10Mb","1 Year",3834,null,"10Mb","1 Year",3834,"10Mb1 Year",null,null,3834,null,null,3384]
["100Mb",1700,"3 Year","100Mb",0,null,null,"100Mb","1 Year",3834,null,"10Mb","3 Years","N/A Select 1 Year Term ","10Mb3 Years",null,null,"N/A Select 1 Year Term ",null,null,"N/A Select 1 Year Term "]
["1Gb",1700,"3 Year","1Gb",0,null,null,"1Gb","1 Year",3834,null,"10Mb","5 Years","N/A Select 1 Year Term ","10Mb5 Years",null,null,"N/A Select 1 Year Term ",null,null,"N/A Select 1 Year Term "]
["10Gb",6000,"3 Year","10Gb",0,null,null,"10Gb","1 Year",6714,null,"100Mb","1 Year",3834,"100Mb1 Year",null,null,3834,null,null,3384]
[null,null,null,null,null,null,null,null,null,null,null,"100Mb","3 Years","N/A Select 1 Year Term","100Mb3 Years",null,null,"N/A Select 1 Year Term",null,null,"N/A Select 1 Year Term"]
["100Gb",15000,"3 Year","100Gb",0,null,null,"100Gb","1 Year",37175,null,"100Mb","5 Years","N/A Select 1 Year Term ","100Mb5 Years",null,null,"N/A Select 1 Year Term ",null,null,"N/A Select 1 Year Term "]
[null,null,null,null,null,null,null,null,null,null,null,"1Gb","1 Year",3834,"1Gb1 Year",null,null,3834,null,null,3384]
{"$rows_left_out":30}
{"sheet":"OWAS","index":9,"n_rows":29,"n_cols":9,"rows_kept":29,"cut":false,"hidden":true,"merged":[]}
[null,"Service OWAS","Connection Charge - New Fibre (per end)","Price Change","Service OWAS","Connection Charge - Existing Fibre (per end)",null,"Service OWAS","Rental Charge 5yr"]
[null,"OWAS 10Gb +filter",{"$f":"15527/2","v":7763.5},"2023-04-01","OWAS 10Gb +filter",{"$f":"15527/2","v":7763.5},null,"OWAS 10Gb +filter",7332]
[null,"Additional 10Gb Wavelength",750,null,"Additional 10Gb Wavelength",750,null,"Additional 10Gb Wavelength",1959]
[null,"Resilient OWAS 10Gb +filter inc amplification","POA",null,"Resilient OWAS 10Gb +filter inc amplification","POA",null,"Resilient OWAS 10Gb +filter inc amplification","POA"]
[null,"Excess Construction Charge","POA",null,"Excess Construction Charge","POA",null,"Excess Construction Charge","POA"]
[]
["Single Order",null,null,"CONNECTION A",null,null,"Connection B","Total connection","rental"]
[1,"Connection A End",{"$f":"'CP & Installation Detail'!E35","v":"New"},{"$f":"IF('CP & Installation Detail'!E35=\"New\",VLOOKUP('CP & Installation Detail'!E15,B2:C5,2,FALSE),IF('CP & Installation Detail'!E35=\"Existing\",VLOOKUP('CP & Installation Detail'!E15,E2:F5,2,FALSE),\"\"))","v":{"$error":"#N/A"}},"Connection B End",{"$f":"'CP & Installation Detail'!I35","v":"New"},{"$f":"IF('CP & Installation Detail'!I35=\"New\",VLOOKUP('CP & Installation Detail'!E15,B2:C5,2,FALSE),IF('CP & Installation Detail'!I35=\"Existing\",VLOOKUP('CP & Installation Detail'!E15,E2:F5,2,FALSE),\"\"))","v":{"$error":"#N/A"}},{"$f":"SUM(D8+G8)","v":{"$error":"#N/A"}},{"$f":"IF('CP & Installation Detail'!E15=\"OWAS 10Gb +filter\",VLOOKUP('CP & Installation Detail'!E15,H2:I5,2,FALSE),IF('CP & Installation Detail'!E15=\"Additional 10Gb Wavelength\",VLOOKUP('CP & Installation Detail'!E15,H2:I5,2,FALSE),\"£\"))","v":"£"}]
{"$rows_left_out":22}
{"sheet":"Data Connect Access Costs","index":10,"n_rows":33,"n_cols":11,"rows_kept":33,"cut":false,"hidden":true,"merged":[]}
["Bandwidth","New Fibre Connection Charge",null,null,null,null,"Bandwidth","Term"," Rental Charge",null,"Values pre 1/5/23"]
["64Kb",890,null,null,null,null,"2Mb","1 Year",11136,{"$f":"G2&H2","v":"2Mb1 Year"},10032.4]
["128Kb",890,null,null,null,null,"2Mb","3 Years",11136,"2Mb3 Years",10032.4]
["192Kb",890,null,null,null,null,"34Mb","1 Year",17400,"34Mb1 Year",17400]
["256Kb",890,null,null,null,null,"34Mb","3 Years",15660,"34Mb3 Years",15660]
["320Kb",3150,null,null,null,null,"45Mb","1 Year",21750,"45Mb1 Year",21750]
["384Kb",3150,null,null,null,null,"45Mb","3 Years",19752,"45Mb3 Years",19752]
["448Kb",3150,null,null,null,null,"155Mb","1 Year",52221,"155Mb1 Year",52221]
{"$rows_left_out":26}
{"sheet":"Data Direct Access Costs","index":11,"n_rows":31,"n_cols":8,"rows_kept":31,"cut":false,"hidden":true,"merged":[]}
["Bandwidth","New Fibre Connection Charge",null,"Bandwidth","Existing Fibre Connection Charge"]
["2Mb",3150,null,"2Mb",3150]
["34Mb",8090,null,"34Mb",8090]
["45Mb",8090,null,"45Mb",8090]
["155Mb",16160,null,"155Mb",16160]
[]
[]
[]
{"$rows_left_out":23}